{"text_format":"1","workbook":"xlsx","n_sheets":19,"sheets":["Hyppy","Nojapuut","Puomi","Permanto","Rekki","Hevonen","Tulokset","FinaaliHE","FinaaliPP","FinaaliNR","HyppyT","NojapuutT","PuomiT","PermantoT","RekkiT","HevonenT","Asetukset","Tulostus","Nimilista"],"not_rendered":{"charts":0,"images":31,"macros":1,"external_links":0,"defined_names":56,"comments":0,"pivot_tables":0},"unopened":[],"bounds":{"document_bytes":16777216,"sheet_cells":100000,"rows_first":2000,"rows_last":500,"rows_between":2000,"halvings":0,"cell_chars":16384,"cell_head_chars":4096},"cells_cut":0,"cells_raw":0,"read":"whole","date_system":"1900"}

{"sheet":"Hyppy","index":0,"n_rows":34,"n_cols":23,"rows_kept":34,"cut":false,"hidden":false,"merged":[[0,0,0,2]]}
["Hyppy",null,null,null,40,"1",null,null,null,null,null,null,"",null,"2",null,null,null,null,null,null,""]
[0,"Nr","Nimi","Seura","suor","D","E1","E2","E3","E4","väh","E","Yhteensä",null,"D","E1","E2","E3","E4","väh","E","Yhteensä","Tulos"]
[1,34,{"$f":"VLOOKUP($B3,nimilista,2,FALSE)","v":"Pihla-Maaria Ojala"},{"$f":"VLOOKUP($B3,nimilista,5,FALSE)","v":"Oulun Pyrintö"},null,null,null,null,null,null,null,{"$f":"IF(ISBLANK(J3),\"\",10-(SUM(G3:J3)-MIN(G3:J3)-MAX(G3:J3))/2)","v":""},{"$f":"IF(ISBLANK(J3),0,F3-K3+L3)","v":0},null,null,null,null,null,null,null,{"$f":"IF(ISBLANK(S3),\"\",10-(SUM(P3:S3)-MIN(P3:S3)-MAX(P3:S3))/2)","v":""},{"$f":"IF(ISBLANK(S3),0,O3-T3+U3)","v":0},{"$f":"IF(ISBLANK(S3),\"\",(M3+V3)/2)","v":""}]
[2,36,"Erika Pakkala","Suomen Taitovoimistelu Klubi",null,null,null,null,null,null,null,{"$f":"IF(ISBLANK(J4),\"\",10-(SUM(G4:J4)-MIN(G4:J4)-MAX(G4:J4))/2)","v":""},{"$f":"IF(ISBLANK(J4),0,F4-K4+L4)","v":0},null,null,null,null,null,null,null,{"$f":"IF(ISBLANK(S4),\"\",10-(SUM(P4:S4)-MIN(P4:S4)-MAX(P4:S4))/2)","v":""},{"$f":"IF(ISBLANK(S4),0,O4-T4+U4)","v":0},{"$f":"IF(ISBLANK(S4),\"\",(M4+V4)/2)","v":""}]
[3,40,"Annika Urvikko","Tampereen Voimistelijat",null,2,1,1,1,1,null,{"$f":"IF(ISBLANK(J5),\"\",10-(SUM(G5:J5)-MIN(G5:J5)-MAX(G5:J5))/2)","v":9},{"$f":"IF(ISBLANK(J5),0,F5-K5+L5)","v":11},null,null,null,null,null,null,null,{"$f":"IF(ISBLANK(S5),\"\",10-(SUM(P5:S5)-MIN(P5:S5)-MAX(P5:S5))/2)","v":""},{"$f":"IF(ISBLANK(S5),0,O5-T5+U5)","v":0},""]
[4,44,"Rosanna Ojala","Tampereen Voimistelijat",null,null,null,null,null,null,null,"",0,null,null,null,null,null,null,null,"",0,""]
{"$rows_left_out":29}
{"sheet":"Nojapuut","index":1,"n_rows":34,"n_cols":13,"rows_kept":34,"cut":false,"hidden":false,"merged":[[0,0,0,2]]}
["Eritasonojapuut",null,null,null,52,null,null,null,null,null,null,null,""]
[0,"Nr","Nimi","Seura","suor","D","E1","E2","E3","E4","väh","E","Yhteensä"]
[1,34,{"$f":"VLOOKUP($B3,nimilista,2,FALSE)","v":"Pihla-Maaria Ojala"},{"$f":"VLOOKUP($B3,nimilista,5,FALSE)","v":"Oulun Pyrintö"},null,null,null,null,null,null,null,{"$f":"IF(ISBLANK(J3),\"\",10-(SUM(G3:J3)-MIN(G3:J3)-MAX(G3:J3))/2)","v":""},{"$f":"IF(ISBLANK(J3),0,F3-K3+L3)","v":0}]
[2,36,"Erika Pakkala","Suomen Taitovoimistelu Klubi",null,null,null,null,null,null,null,{"$f":"IF(ISBLANK(J4),\"\",10-(SUM(G4:J4)-MIN(G4:J4)-MAX(G4:J4))/2)","v":""},{"$f":"IF(ISBLANK(J4),0,F4-K4+L4)","v":0}]
[3,40,"Annika Urvikko","Tampereen Voimistelijat",null,null,null,null,null,null,null,{"$f":"IF(ISBLANK(J5),\"\",10-(SUM(G5:J5)-MIN(G5:J5)-MAX(G5:J5))/2)","v":""},{"$f":"IF(ISBLANK(J5),0,F5-K5+L5)","v":0}]
[4,44,"Rosanna Ojala","Tampereen Voimistelijat",null,null,null,null,null,null,null,"",0]
{"$rows_left_out":29}
{"sheet":"Puomi","index":2,"n_rows":34,"n_cols":13,"rows_kept":34,"cut":false,"hidden":false,"merged":[[0,0,0,2]]}
["Puomi",null,null,null,null,null,null,null,null,null,null,null,""]
[0,"Nr","Nimi","Seura","suor","D","E1","E2","E3","E4","väh","E","Yhteensä"]
[1,36,{"$f":"VLOOKUP($B3,nimilista,2,FALSE)","v":"Erika Pakkala"},{"$f":"VLOOKUP($B3,nimilista,5,FALSE)","v":"Suomen Taitovoimistelu Klubi"},null,null,null,null,null,null,null,{"$f":"IF(ISBLANK(J3),\"\",10-(SUM(G3:J3)-MIN(G3:J3)-MAX(G3:J3))/2)","v":""},{"$f":"IF(ISBLANK(J3),0,F3-K3+L3)","v":0}]
[2,40,"Annika Urvikko","Tampereen Voimistelijat",null,null,null,null,null,null,null,{"$f":"IF(ISBLANK(J4),\"\",10-(SUM(G4:J4)-MIN(G4:J4)-MAX(G4:J4))/2)","v":""},{"$f":"IF(ISBLANK(J4),0,F4-K4+L4)","v":0}]
[3,41,"Emmiina Sulkanen","Tampereen Voimistelijat",null,null,null,null,null,null,null,{"$f":"IF(ISBLANK(J5),\"\",10-(SUM(G5:J5)-MIN(G5:J5)-MAX(G5:J5))/2)","v":""},{"$f":"IF(ISBLANK(J5),0,F5-K5+L5)","v":0}]
[4,44,"Rosanna Ojala","Tampereen Voimistelijat",null,null,null,null,null,null,null,"",0]
{"$rows_left_out":29}
{"sheet":"Permanto","index":3,"n_rows":34,"n_cols":13,"rows_kept":34,"cut":false,"hidden":false,"merged":[[0,0,0,2]]}
["Permanto",null,null,null,null,null,null,null,null,null,null,null,""]
[0,"Nr","Nimi","Seura","suor","D","E1","E2","E3","E4","väh","E","Yhteensä"]
[1,34,{"$f":"VLOOKUP($B3,nimilista,2,FALSE)","v":"Pihla-Maaria Ojala"},{"$f":"VLOOKUP($B3,nimilista,5,FALSE)","v":"Oulun Pyrintö"}," ",null,null,null,null,null,null,{"$f":"IF(ISBLANK(J3),\"\",10-(SUM(G3:J3)-MIN(G3:J3)-MAX(G3:J3))/2)","v":""},{"$f":"IF(ISBLANK(J3),0,F3-K3+L3)","v":0}]
[2,36,"Erika Pakkala","Suomen Taitovoimistelu Klubi"," ",null,null,null,null,null,null,{"$f":"IF(ISBLANK(J4),\"\",10-(SUM(G4:J4)-MIN(G4:J4)-MAX(G4:J4))/2)","v":""},{"$f":"IF(ISBLANK(J4),0,F4-K4+L4)","v":0}]
[3,40,"Annika Urvikko","Tampereen Voimistelijat"," ",null,null,null,null,null,null,{"$f":"IF(ISBLANK(J5),\"\",10-(SUM(G5:J5)-MIN(G5:J5)-MAX(G5:J5))/2)","v":""},{"$f":"IF(ISBLANK(J5),0,F5-K5+L5)","v":0}]
[4,44,"Rosanna Ojala","Tampereen Voimistelijat"," ",null,null,null,null,null,null,"",0]
{"$rows_left_out":29}
{"sheet":"Rekki","index":4,"n_rows":34,"n_cols":13,"rows_kept":34,"cut":false,"hidden":false,"merged":[[0,0,0,2]]}
["Rekki",null,null,null,3,null,null,null,null,null,null,null,""]
[0,"Nr","Nimi","Seura","suor","D","E1","E2","E3","E4","väh","E","Yhteensä"]
[1,30,{"$f":"VLOOKUP($B3,nimilista,2,FALSE)","v":"Emilia Nevalainen"},{"$f":"VLOOKUP($B3,nimilista,5,FALSE)","v":"Alppilan Salamat"},null,null,null,null,null,null,null,{"$f":"IF(ISBLANK(J3),\"\",10-(SUM(G3:J3)-MIN(G3:J3)-MAX(G3:J3))/2)","v":""},{"$f":"IF(ISBLANK(J3),0,F3-K3+L3)","v":0}]
[2,31,"Mari Kuoppala","Oulun Pyrintö",null,null,null,null,null,null,null,{"$f":"IF(ISBLANK(J4),\"\",10-(SUM(G4:J4)-MIN(G4:J4)-MAX(G4:J4))/2)","v":""},{"$f":"IF(ISBLANK(J4),0,F4-K4+L4)","v":0}]
[3,32,"Meri-Tuuli Himanen","Oulun Pyrintö",null,null,null,null,null,null,null,{"$f":"IF(ISBLANK(J5),\"\",10-(SUM(G5:J5)-MIN(G5:J5)-MAX(G5:J5))/2)","v":""},{"$f":"IF(ISBLANK(J5),0,F5-K5+L5)","v":0}]
[4,33,"Milja Pulkkinen","Oulun Pyrintö",null,null,null,null,null,null,null,"",0]
{"$rows_left_out":29}
{"sheet":"Hevonen","index":5,"n_rows":34,"n_cols":13,"rows_kept":34,"cut":false,"hidden":false,"merged":[[0,0,0,2]]}
["Hevonen",null,null,null,3,null,null,null,null,null,null,null,""]
[0,"Nr","Nimi","Seura","suor","D","E1","E2","E3","E4","väh","E","Yhteensä"]
[1,30,{"$f":"VLOOKUP($B3,nimilista,2,FALSE)","v":"Emilia Nevalainen"},{"$f":"VLOOKUP($B3,nimilista,5,FALSE)","v":"Alppilan Salamat"},null,null,null,null,null,null,null,{"$f":"IF(ISBLANK(J3),\"\",10-(SUM(G3:J3)-MIN(G3:J3)-MAX(G3:J3))/2)","v":""},{"$f":"IF(ISBLANK(J3),0,F3-K3+L3)","v":0}]
[2,31,"Mari Kuoppala","Oulun Pyrintö",null,null,null,null,null,null,null,{"$f":"IF(ISBLANK(J4),\"\",10-(SUM(G4:J4)-MIN(G4:J4)-MAX(G4:J4))/2)","v":""},{"$f":"IF(ISBLANK(J4),0,F4-K4+L4)","v":0}]
[3,32,"Meri-Tuuli Himanen","Oulun Pyrintö",null,null,null,null,null,null,null,{"$f":"IF(ISBLANK(J5),\"\",10-(SUM(G5:J5)-MIN(G5:J5)-MAX(G5:J5))/2)","v":""},{"$f":"IF(ISBLANK(J5),0,F5-K5+L5)","v":0}]
[4,33,"Milja Pulkkinen","Oulun Pyrintö",null,null,null,null,null,null,null,"",0]
{"$rows_left_out":29}
{"sheet":"Tulokset","index":6,"n_rows":27,"n_cols":15,"rows_kept":27,"cut":false,"hidden":false,"merged":[[2,0,2,2],[1,4,1,5],[0,4,0,5],[1,6,1,8],[1,11,1,12],[0,6,0,8],[0,11,0,12]]}
[{"$f":"teline1","v":1},{"$f":"kuka1","v":40},{"$f":"IF($B1<=0,\"\",VLOOKUP(B1,B4:M27,2,FALSE))","v":"Annika Urvikko"},null,{"$f":"IF($B1<=0,\"\",VLOOKUP($B1,$B$5:$M$27,($A1-1)*2+4,FALSE))","v":2},null,{"$f":"IF($B1<=0,\"\",VLOOKUP($B1,$B$5:$M$27,($A1-1)*2+5,FALSE))","v":11},null,null,null,null,{"$f":"IF($B1<=0,\"\",VLOOKUP($B1,$B$5:$M$27,12,FALSE))","v":11}]
[{"$f":"teline2","v":2},{"$f":"kuka2","v":52},{"$f":"IF($B2<=0,\"\",VLOOKUP(B2,B5:M27,2,FALSE))","v":"Mimosa Raitamaa"},null,{"$f":"IF($B2<=0,\"\",VLOOKUP($B2,$B$5:$M$27,($A2-1)*2+4,FALSE))","v":0},null,{"$f":"IF($B2<=0,\"\",VLOOKUP($B2,$B$5:$M$27,($A2-1)*2+5,FALSE))","v":0},null,null,null,null,{"$f":"IF($B2<=0,\"\",VLOOKUP($B2,$B$5:$M$27,12,FALSE))","v":{"$error":"#N/A"}}]
[{"$f":"Tulostus!A3","v":"Naisten 4-ottelu"},null,null,null,null,{"$f":"Permanto!$M$1","v":""},null,{"$f":"Hevonen!$M$1","v":""},null,{"$f":"Puomi!$M$1","v":""},null,{"$f":"Rekki!$M$1","v":""},null,"ero"]
[0,"Nr","Nimi","Seura","D","yht","D","yht","D","yht","D","yht","Yhteensä","kärkeen"]
[{"$f":"A4+1","v":1},{"$f":"Tulostus!B5","v":30},{"$f":"Tulostus!C5","v":"Emilia Nevalainen"},{"$f":"VLOOKUP(B5,nimilista,6,FALSE)","v":"AS"},{"$f":"Tulostus!E5","v":{"$error":"#N/A"}},{"$f":"Tulostus!F5","v":{"$error":"#N/A"}},{"$f":"Tulostus!G5","v":{"$error":"#N/A"}},{"$f":"Tulostus!H5","v":{"$error":"#N/A"}},{"$f":"Tulostus!I5","v":{"$error":"#N/A"}},{"$f":"Tulostus!J5","v":{"$error":"#N/A"}},{"$f":"Tulostus!K5","v":{"$error":"#N/A"}},{"$f":"Tulostus!L5","v":{"$error":"#N/A"}},{"$f":"Tulostus!M5","v":{"$error":"#N/A"}},{"$f":"M5-$M$5","v":{"$error":"#N/A"}}]
[2,{"$f":"Tulostus!B6","v":31},{"$f":"Tulostus!C6","v":"Mari Kuoppala"},"OP",{"$f":"Tulostus!E6","v":{"$error":"#N/A"}},{"$f":"Tulostus!F6","v":{"$error":"#N/A"}},{"$f":"Tulostus!G6","v":{"$error":"#N/A"}},{"$f":"Tulostus!H6","v":{"$error":"#N/A"}},{"$f":"Tulostus!I6","v":{"$error":"#N/A"}},{"$f":"Tulostus!J6","v":{"$error":"#N/A"}},{"$f":"Tulostus!K6","v":{"$error":"#N/A"}},{"$f":"Tulostus!L6","v":{"$error":"#N/A"}},{"$f":"Tulostus!M6","v":{"$error":"#N/A"}},{"$error":"#N/A"},{"$f":"IF((M6=M5),IF((M6=0),\"\",\"tie\"),\"\")","v":{"$error":"#N/A"}}]
{"$rows_left_out":22}
{"sheet":"FinaaliHE","index":7,"n_rows":40,"n_cols":15,"rows_kept":40,"cut":false,"hidden":false,"merged":[[0,10,0,11],[0,12,0,13],[12,12,12,13],[13,0,13,2],[0,6,0,7],[1,0,1,2],[12,6,12,7],[12,10,12,11],[0,4,0,5],[12,4,12,5]]}
[1,{"$f":"kuka1","v":40},{"$f":"IF($B1<=0,\"\",VLOOKUP($B1,hyppy,C$40,FALSE))","v":"Annika Urvikko"},null,{"$f":"IF($B1<=0,\"\",VLOOKUP($B1,Hyppy!$B$3:$M$43,E$40,FALSE))","v":2},{"$f":"IF($B1<=0,\"\",VLOOKUP($B1,Permanto!$B$3:$M$43,F$40,FALSE))","v":{"$error":"#VALUE!"}},{"$f":"IF($B1<=0,\"\",VLOOKUP($B1,hyppy,G$40,FALSE))","v":11},{"$f":"IF($B1<=0,\"\",VLOOKUP($B1,hyppy,H$40,FALSE))","v":{"$error":"#VALUE!"}},{"$f":"IF($B1<=0,\"\",VLOOKUP($B1,hyppy,I$40,FALSE))","v":0},null,{"$f":"IF($B1<=0,\"\",VLOOKUP($B1,hyppy,K$40,FALSE))","v":0},{"$f":"IF($B1<=0,\"\",VLOOKUP($B1,hyppy,L$40,FALSE))","v":{"$error":"#VALUE!"}},{"$f":"IF($B1<=0,\"\",VLOOKUP($B1,hyppy,M$40,FALSE))","v":""},{"$f":"IF($B1<=0,\"\",VLOOKUP($B1,hyppy,N$40,FALSE))","v":{"$error":"#VALUE!"}}]
["Hyppy",null,null,null,null,"1",null,"",null,"2",null,""]
[0,"Nr","Nimi","Seura","D","E","väh","Yhteensä","D","E","väh","Yhteensä","Tulos"]
[1,{"$f":"HyppyT!B5","v":34},{"$f":"HyppyT!C5","v":"Pihla-Maaria Ojala"},{"$f":"VLOOKUP(B4,nimilista,6,FALSE)","v":"OP"},{"$f":"HyppyT!E5","v":0},{"$f":"HyppyT!F5","v":""},{"$f":"HyppyT!G5","v":0},{"$f":"HyppyT!H5","v":0},{"$f":"HyppyT!I5","v":0},{"$f":"HyppyT!J5","v":""},{"$f":"HyppyT!K5","v":0},{"$f":"HyppyT!L5","v":0},{"$f":"HyppyT!M5","v":0}]
[2,{"$f":"HyppyT!B6","v":36},{"$f":"HyppyT!C6","v":"Erika Pakkala"},"STVK",{"$f":"HyppyT!E6","v":0},{"$f":"HyppyT!F6","v":""},{"$f":"HyppyT!G6","v":0},{"$f":"HyppyT!H6","v":0},{"$f":"HyppyT!I6","v":0},{"$f":"HyppyT!J6","v":""},{"$f":"HyppyT!K6","v":0},{"$f":"HyppyT!L6","v":0},{"$f":"HyppyT!M6","v":0}]
[3,{"$f":"HyppyT!B7","v":40},{"$f":"HyppyT!C7","v":"Annika Urvikko"},"TV",{"$f":"HyppyT!E7","v":2},{"$f":"HyppyT!F7","v":9},{"$f":"HyppyT!G7","v":0},{"$f":"HyppyT!H7","v":11},{"$f":"HyppyT!I7","v":0},{"$f":"HyppyT!J7","v":""},{"$f":"HyppyT!K7","v":0},{"$f":"HyppyT!L7","v":0},{"$f":"HyppyT!M7","v":5.5}]
{"$rows_left_out":35}
{"sheet":"FinaaliPP","index":8,"n_rows":40,"n_cols":10,"rows_kept":40,"cut":false,"hidden":false,"merged":[[0,6,0,7],[1,0,1,2],[12,6,12,7],[13,0,13,2],[0,4,0,5],[12,4,12,5]]}
[{"$f":"Asetukset!C21","v":1},{"$f":"kuka1","v":40},{"$f":"IF($B1<=0,\"\",VLOOKUP($B1,Puomi,C$40,FALSE))","v":"Annika Urvikko"},null,{"$f":"IF($B1<=0,\"\",VLOOKUP($B1,Puomi,E$40,FALSE))","v":0},{"$f":"IF($B1<=0,\"\",VLOOKUP($B1,permanto,F$40,FALSE))","v":{"$error":"#VALUE!"}},{"$f":"IF($B1<=0,\"\",VLOOKUP($B1,Puomi,G$40,FALSE))","v":0},{"$f":"IF($B1<=0,\"\",VLOOKUP($B1,permanto,H$40,FALSE))","v":{"$error":"#VALUE!"}}]
["Puomi",null,null,null,null,null,null,""]
[0,"Nr","Nimi","Seura","D","E","väh","Yhteensä"]
[1,{"$f":"PuomiT!B5","v":36},{"$f":"PuomiT!C5","v":"Erika Pakkala"},{"$f":"VLOOKUP(B4,nimilista,6,FALSE)","v":"STVK"},{"$f":"PuomiT!E5","v":0},{"$f":"PuomiT!F5","v":""},{"$f":"PuomiT!G5","v":0},{"$f":"PuomiT!H5","v":0},null,{"$f":"IF((H4=H3),IF((H4=0),\"\",\"tie\"),\"\")","v":""}]
[2,{"$f":"PuomiT!B6","v":40},{"$f":"PuomiT!C6","v":"Annika Urvikko"},"TV",{"$f":"PuomiT!E6","v":0},{"$f":"PuomiT!F6","v":""},{"$f":"PuomiT!G6","v":0},{"$f":"PuomiT!H6","v":0},null,""]
[3,{"$f":"PuomiT!B7","v":41},{"$f":"PuomiT!C7","v":"Emmiina Sulkanen"},"TV",{"$f":"PuomiT!E7","v":0},{"$f":"PuomiT!F7","v":""},{"$f":"PuomiT!G7","v":0},{"$f":"PuomiT!H7","v":0},null,""]
{"$rows_left_out":35}
{"sheet":"FinaaliNR","index":9,"n_rows":40,"n_cols":10,"rows_kept":40,"cut":false,"hidden":false,"merged":[[0,6,0,7],[1,0,1,2],[12,6,12,7],[13,0,13,2],[0,4,0,5],[12,4,12,5]]}
[1,{"$f":"kuka1","v":40},{"$f":"IF($B1<=0,\"\",VLOOKUP($B1,nojapuut,C$40,FALSE))","v":"Annika Urvikko"},null,{"$f":"IF($B1<=0,\"\",VLOOKUP($B1,nojapuut,E$40,FALSE))","v":0},{"$f":"IF($B1<=0,\"\",VLOOKUP($B1,nojapuut,F$40,FALSE))","v":{"$error":"#VALUE!"}},{"$f":"IF($B1<=0,\"\",VLOOKUP($B1,nojapuut,G$40,FALSE))","v":0},{"$f":"IF($B1<=0,\"\",VLOOKUP($B1,nojapuut,H$40,FALSE))","v":{"$error":"#VALUE!"}}]
["Nojapuut",null,null,null,null,null,null,""]
[0,"Nr","Nimi","Seura","D","väh","E","Yhteensä"]
[1,{"$f":"NojapuutT!B5","v":34},{"$f":"NojapuutT!C5","v":"Pihla-Maaria Ojala"},{"$f":"VLOOKUP(B4,nimilista,6,FALSE)","v":"OP"},{"$f":"NojapuutT!E5","v":0},{"$f":"NojapuutT!F5","v":""},{"$f":"NojapuutT!G5","v":0},{"$f":"NojapuutT!H5","v":0},null,{"$f":"IF((H4=H3),IF((H4=0),\"\",\"tie\"),\"\")","v":""}]
[2,{"$f":"NojapuutT!B6","v":36},{"$f":"NojapuutT!C6","v":"Erika Pakkala"},"STVK",{"$f":"NojapuutT!E6","v":0},{"$f":"NojapuutT!F6","v":""},{"$f":"NojapuutT!G6","v":0},{"$f":"NojapuutT!H6","v":0},null,""]
[3,{"$f":"NojapuutT!B7","v":40},{"$f":"NojapuutT!C7","v":"Annika Urvikko"},"TV",{"$f":"NojapuutT!E7","v":0},{"$f":"NojapuutT!F7","v":""},{"$f":"NojapuutT!G7","v":0},{"$f":"NojapuutT!H7","v":0},null,""]
{"$rows_left_out":35}
{"sheet":"HyppyT","index":10,"n_rows":26,"n_cols":15,"rows_kept":26,"cut":false,"hidden":false,"merged":[[1,14,1,15],[2,0,2,2],[0,3,0,7],[1,6,1,7],[1,10,1,11],[1,12,1,13]]}
[null,null,null,{"$f":"Tulostus!D1","v":"Suomen                            mestaruuskilpailut            Jyväskylä 17.4.2011"}]
[null,null,null,null,null,null,1,null,null,null,2]
["Hyppy",null,null,{"$f":"tulosotsikko","v":"Tytöt,karsinta"},5,11,10,12,14,20,19,21]
["sij","Nr","Nimi","Seura","D","E","väh","Yhteensä","D","E","väh","Yhteensä","Tulos"]
[1,34,{"$f":"VLOOKUP($B5,nimilista,2,FALSE)","v":"Pihla-Maaria Ojala"},{"$f":"VLOOKUP($B5,nimilista,5,FALSE)","v":"Oulun Pyrintö"},{"$f":"VLOOKUP($B5,hyppy,E$3,FALSE)","v":0},"",0,0,0,"",0,0,{"$f":"(H5+L5)/2","v":0},null,{"$f":"IF((M5=M4),IF((M5=0),\"\",\"tie\"),\"\")","v":""}]
[2,36,"Erika Pakkala","Suomen Taitovoimistelu Klubi",0,"",0,0,0,"",0,0,0,null,""]
{"$rows_left_out":21}
{"sheet":"NojapuutT","index":11,"n_rows":26,"n_cols":10,"rows_kept":26,"cut":false,"hidden":false,"merged":[[1,6,1,7],[2,0,2,2]]}
[null,null,null,{"$f":"Tulostus!D1","v":"Suomen                            mestaruuskilpailut            Jyväskylä 17.4.2011"}]
[]
["Eritasonojapuut",null,null,{"$f":"tulosotsikko","v":"Tytöt,karsinta"},5,11,10,12]
[0,"Nr","Nimi","Seura","D","E","väh","Yhteensä"]
[1,34,{"$f":"VLOOKUP($B5,nimilista,2,FALSE)","v":"Pihla-Maaria Ojala"},{"$f":"VLOOKUP($B5,nimilista,5,FALSE)","v":"Oulun Pyrintö"},{"$f":"VLOOKUP($B5,nojapuut,E$3,FALSE)","v":0},"",0,0,null,{"$f":"IF((H5=H4),IF((H5=0),\"\",\"tie\"),\"\")","v":""}]
[2,36,"Erika Pakkala","Suomen Taitovoimistelu Klubi",0,"",0,0,null,""]
{"$rows_left_out":21}
{"sheet":"PuomiT","index":12,"n_rows":26,"n_cols":10,"rows_kept":26,"cut":false,"hidden":false,"merged":[[1,6,1,7],[2,0,2,2]]}
[null,null,null,{"$f":"Tulostus!D1","v":"Suomen                            mestaruuskilpailut            Jyväskylä 17.4.2011"}]
[]
["Puomi",null,null,{"$f":"tulosotsikko","v":"Tytöt,karsinta"},5,11,10,12]
[0,"Nr","Nimi","Seura","D","E","väh","Yhteensä"]
[1,36,{"$f":"VLOOKUP($B5,nimilista,2,FALSE)","v":"Erika Pakkala"},{"$f":"VLOOKUP($B5,nimilista,5,FALSE)","v":"Suomen Taitovoimistelu Klubi"},{"$f":"VLOOKUP($B5,Puomi,E$3,FALSE)","v":0},"",0,0,null,{"$f":"IF((H5=H4),IF((H5=0),\"\",\"tie\"),\"\")","v":""}]
[2,40,"Annika Urvikko","Tampereen Voimistelijat",0,"",0,0,null,""]
{"$rows_left_out":21}
{"sheet":"PermantoT","index":13,"n_rows":10,"n_cols":10,"rows_kept":10,"cut":false,"hidden":false,"merged":[[1,6,1,7],[1,10,1,11],[1,14,1,15],[2,0,2,2]]}
[null,null,null,{"$f":"Tulostus!D1","v":"Suomen                            mestaruuskilpailut            Jyväskylä 17.4.2011"}]
[]
["Permanto",null,null,{"$f":"tulosotsikko","v":"Tytöt,karsinta"},5,11,10,12]
[0,"Nr","Nimi","Seura","D","E","väh","Yhteensä"]
[1,34,{"$f":"VLOOKUP($B5,nimilista,2,FALSE)","v":"Pihla-Maaria Ojala"},{"$f":"VLOOKUP($B5,nimilista,5,FALSE)","v":"Oulun Pyrintö"},{"$f":"VLOOKUP($B5,permanto,E$3,FALSE)","v":0},"",0,0,null,{"$f":"IF((H5=H4),IF((H5=0),\"\",\"tie\"),\"\")","v":""}]
[2,36,"Erika Pakkala","Suomen Taitovoimistelu Klubi",0,"",0,0,null,""]
{"$rows_left_out":5}
{"sheet":"RekkiT","index":14,"n_rows":52,"n_cols":10,"rows_kept":52,"cut":false,"hidden":false,"merged":[[1,6,1,7],[2,0,2,2]]}
[null,null,null,{"$f":"Tulostus!D1","v":"Suomen                            mestaruuskilpailut            Jyväskylä 17.4.2011"}]
[]
["Rekki",null,null,{"$f":"tulosotsikko","v":"Tytöt,karsinta"},5,10,11,12]
[0,"Nr","Nimi","Seura","D","väh","E","Yhteensä"]
[1,30,{"$f":"VLOOKUP($B5,nimilista,2,FALSE)","v":"Emilia Nevalainen"},{"$f":"VLOOKUP($B5,nimilista,5,FALSE)","v":"Alppilan Salamat"},{"$f":"VLOOKUP($B5,rekki,E$3,FALSE)","v":0},0,"",0,null,{"$f":"IF((H5=H4),IF((H5=0),\"\",\"tie\"),\"\")","v":""}]
[2,31,"Mari Kuoppala","Oulun Pyrintö",0,0,"",0,null,""]
{"$rows_left_out":47}
{"sheet":"HevonenT","index":15,"n_rows":52,"n_cols":10,"rows_kept":52,"cut":false,"hidden":false,"merged":[[1,6,1,7],[1,10,1,11],[1,14,1,15],[2,0,2,2]]}
[null,null,null,{"$f":"Tulostus!D1","v":"Suomen                            mestaruuskilpailut            Jyväskylä 17.4.2011"}]
[]
["Hevonen",null,null,{"$f":"tulosotsikko","v":"Tytöt,karsinta"},5,10,11,12]
[0,"Nr","Nimi","Seura","D","väh","E","Yhteensä"]
[1,30,{"$f":"VLOOKUP($B5,nimilista,2,FALSE)","v":"Emilia Nevalainen"},{"$f":"VLOOKUP($B5,nimilista,5,FALSE)","v":"Alppilan Salamat"},{"$f":"VLOOKUP($B5,hevonen,E$3,FALSE)","v":0},0,"",0,null,{"$f":"IF((H5=H4),IF((H5=0),\"\",\"tie\"),\"\")","v":""}]
[2,31,"Mari Kuoppala","Oulun Pyrintö",0,0,"",0,null,""]
{"$rows_left_out":47}
{"sheet":"Asetukset","index":16,"n_rows":282,"n_cols":19,"rows_kept":282,"cut":false,"hidden":false,"merged":[]}
["Tällä sivulla on ohjelman asetuksia"]
["Asetuksen selitys",null,null,"yksikkö","Lisäselitystä"]
["Korostusväri tuloksen näyttämiseksi",null,36]
["Yhteensä perusväri",null,12,null,"#f8cf50","#eeddff"]
["Perusväri 2",null,"#F7CE40"]
["D-sarakkeen malli",null,9,null,"#F7CE40","#ff00ff",null,"R","G","B"]
{"$rows_left_out":277}
{"sheet":"Tulostus","index":17,"n_rows":27,"n_cols":13,"rows_kept":27,"cut":false,"hidden":false,"merged":[[2,0,2,2],[0,3,0,7]]}
[null,null,null,"Suomen                            mestaruuskilpailut            Jyväskylä 17.4.2011"]
[]
["Naisten 4-ottelu",null,null,null,"Permanto",{"$f":"Permanto!$M$1","v":""},"Hevonen",{"$f":"Hevonen!$M$1","v":""},"Renkaat",{"$f":"Puomi!$M$1","v":""},"Rekki",{"$f":"Rekki!$M$1","v":""}]
[0,"Nr","Nimi","Seura","D","yht","D","yht","D","yht","D","yht","Yhteensä"]
[1,30,{"$f":"VLOOKUP($B5,nimilista,2,FALSE)","v":"Emilia Nevalainen"},{"$f":"VLOOKUP($B5,nimilista,5,FALSE)","v":"Alppilan Salamat"},{"$f":"VLOOKUP($B5,hyppy,5,FALSE)","v":{"$error":"#N/A"}},{"$f":"VLOOKUP($B5,hyppy,12,FALSE)","v":{"$error":"#N/A"}},{"$f":"VLOOKUP($B5,nojapuut,5,FALSE)","v":{"$error":"#N/A"}},{"$f":"VLOOKUP($B5,nojapuut,12,FALSE)","v":{"$error":"#N/A"}},{"$f":"VLOOKUP($B5,Puomi,5,FALSE)","v":{"$error":"#N/A"}},{"$f":"VLOOKUP($B5,Puomi,12,FALSE)","v":{"$error":"#N/A"}},{"$f":"VLOOKUP($B5,permanto,5,FALSE)","v":{"$error":"#N/A"}},{"$f":"VLOOKUP($B5,permanto,12,FALSE)","v":{"$error":"#N/A"}},{"$f":"F5+H5+J5+L5","v":{"$error":"#N/A"}}]
[2,31,"Mari Kuoppala","Oulun Pyrintö",{"$error":"#N/A"},{"$error":"#N/A"},{"$error":"#N/A"},{"$error":"#N/A"},{"$error":"#N/A"},{"$error":"#N/A"},{"$error":"#N/A"},{"$error":"#N/A"},{"$error":"#N/A"}]
{"$rows_left_out":22}
{"sheet":"Nimilista","index":18,"n_rows":27,"n_cols":8,"rows_kept":27,"cut":false,"hidden":false,"merged":[]}
["Nimilista"]
[]
[]
["Nro","Nimi","Seura","Lyhenne","Tulosseura","Nayttoseura","Lyhennetty nimi","Näyttönimi"]
[30,"Emilia Nevalainen","Alppilan Salamat","AS","Alppilan Salamat","AS","E.Nevalainen","E.Nevalainen"]
[31,"Mari Kuoppala","Oulun Pyrintö","OP","Oulun Pyrintö","OP","M.Kuoppala","M.Kuoppala"]
{"$rows_left_out":21}